3α,7β,12α-Trihydroxy-5β-cholanoic acid, methyl ester-trimethylsilyl ether

Normal alkane RI, non-polar column, temperature ramp

Data compiled by: NIST Mass Spectrometry Data Center, William E. Wallace, director

Column type Capillary
Active phase CP Sil 5 CB
Column length (m) 25.
Carrier gas He
Substrate
Column diameter (mm) 0.22
Phase thickness (μm)
Tstart (C) 100.
Tend (C) 278.
Heat rate (K/min) 35.
Initial hold (min) 2.
Final hold (min)
I 3303.
ReferenceBatta, Aggarwal, et al., 1995
Comment MSDC-RI

References

Batta, Aggarwal, et al., 1995
Batta, A.K.; Aggarwal, S.K.; Tint, G.S.; Batta, M.; Salen, G., Capillary gas-liquid chromatography of 6-hydroxylated bile acids, J. Chromatogr. A, 1995, 704, 1, 228-233, https://doi.org/10.1016/0021-9673(95)00183-N . [all data]