[2H3]Dihydrozeatin nucleotide, permethylated

Van Den Dool and Kratz RI, non-polar column, custom temperature program

View large format table.

Column type Active phase I Reference Comment
CapillaryBP-52998.Emery, Leport, et al., 199825. m/0.22 mm/0.25 μm, He; Program: 60C => 20C/min => 200C => 5C/min => 300C (5min)
CapillaryBP-52998.Emery, Leport, et al., 199825. m/0.22 mm/0.25 μm, He; Program: 60C => 20C/min => 200C => 5C/min => 300C (5min)
CapillaryBP-52999.Emery, Leport, et al., 199825. m/0.22 mm/0.25 μm, He; Program: 60C => 20C/min => 200C => 5C/min => 300C (5min)
CapillaryBP-52997.Emery, Leport, et al., 199825. m/0.22 mm/0.25 μm, He; Program: 60C => 20C/min => 200C => 5C/min => 300C (5min)

References

Emery, Leport, et al., 1998
Emery, R.J.N.; Leport, L.; Barton, J.E.; Turner, N.C.; Atkins, C.A., Cis-Isomers of cytokinins predominate in chickpea seeds throughout their development, Plant Physiol., 1998, 117, 4, 1515-1523, https://doi.org/10.1104/pp.117.4.1515 . [all data]