tyrosine, trifluoroacetyl-isopropyl ester

Normal alkane RI, non-polar column, temperature ramp

Data compiled by: NIST Mass Spectrometry Data Center, William E. Wallace, director

Column type Capillary
Active phase SE-54
Column length (m) 25.
Carrier gas He
Substrate
Column diameter (mm) 0.25
Phase thickness (μm) 0.25
Tstart (C) 30.
Tend (C) 250.
Heat rate (K/min) 10.
Initial hold (min) 6.
Final hold (min) 2.
I 1693.
ReferenceDallakian and Budzikiewicz, 1997
Comment MSDC-RI

References

Dallakian and Budzikiewicz, 1997
Dallakian, P.; Budzikiewicz, H., Gas chromatography - chemical ionization mass spectrometry in amino acid analysis of pyoverdins, J. Chromatogr. A, 1997, 787, 1-2, 195-203, https://doi.org/10.1016/S0021-9673(97)00641-9 . [all data]