(Z)-3-Decenal

Normal alkane RI, polar column, temperature ramp

Data compiled by: NIST Mass Spectrometry Data Center, William E. Wallace, director

Column type Capillary
Active phase DB-Wax
Column length (m) 60.
Carrier gas
Substrate
Column diameter (mm) 0.25
Phase thickness (μm)
Tstart (C) 60.
Tend (C) 220.
Heat rate (K/min) 3.
Initial hold (min) 4.
Final hold (min)
I 1641.
ReferenceChung, Eiserich, et al., 1993
Comment MSDC-RI

References

Chung, Eiserich, et al., 1993
Chung, T.Y.; Eiserich, J.P.; Shibamoto, T., Volatile compounds identified in headspace samples of peanut oil heated under temperatures ranging from 50 to 200 °C, J. Agric. Food Chem., 1993, 41, 9, 1467-1470, https://doi.org/10.1021/jf00033a022 . [all data]