Hydroxytetrahydrorhombifoline

Normal alkane RI, non-polar column, custom temperature program

Data compiled by: NIST Mass Spectrometry Data Center, William E. Wallace, director

Column type Capillary
Active phase DB-1
Column length (m) 30.
Carrier gas
Substrate
Column diameter (mm) 0.3
Phase thickness (μm)
Program not specified
I 2138.
ReferenceWink, Meissner, et al., 1995
Comment MSDC-RI

References

Wink, Meissner, et al., 1995
Wink, M.; Meissner, C.; Witte, L., Patterns of quinolizidine alkaloids in 56 species of the genus Lupinus, Phytochemistry, 1995, 38, 1, 139-153, https://doi.org/10.1016/0031-9422(95)91890-D . [all data]