8,14,24,27-tetramethylhentriacontane

Normal alkane RI, non-polar column, temperature ramp

View large format table.

Column type Active phase I Reference Comment
CapillaryCP Sil 5 CB3249.Sinninghe Damsté, Erkes, et al., 19954. K/min; Tstart: 130. C; Tend: 320. C

References

Sinninghe Damsté, Erkes, et al., 1995
Sinninghe Damsté, J.S.; Erkes, A.-M.W.E.P.; Rijpstra, W.I.C.; de Leeuw, J.W.; Wakeham, S.G., C32-C36 polymethyl alkenes in Black Sea sediments, Geochim. Cosmochim. Acta, 1995, 59, 2, 347-353, https://doi.org/10.1016/0016-7037(95)00281-4 . [all data]