Fluoxymesterone, bis-TMS (2,4-diene)

Van Den Dool and Kratz RI, non-polar column, temperature ramp

Data compiled by: NIST Mass Spectrometry Data Center, William E. Wallace, director

Column type Capillary
Active phase HP-1
Column length (m) 17.
Carrier gas He
Substrate
Column diameter (mm) 0.2
Phase thickness (μm) 0.11
Tstart (C) 180.
Tend (C) 320.
Heat rate (K/min) 5.
Initial hold (min)
Final hold (min)
I 2912.
ReferenceSchänzer, Horning, et al., 1995
Comment MSDC-RI

References

Schänzer, Horning, et al., 1995
Schänzer, W.; Horning, S.; Donike, M., Metabolism of anabolic steroids in humans: Synthesis of 6β-hydroxy metabolites of 4-chloro-1,2-dehydro-17α -methyltestosterone, fluoxymesterone, and metandienone, Steroids, 1995, 60, 4, 353-366, https://doi.org/10.1016/0039-128X(95)00008-E . [all data]