Acetic acid 5-ethoxy-4-methoxy-2-methoxymethyl-tetrahydro-pyran-3-yl ester

Van Den Dool and Kratz RI, non-polar column, temperature ramp

View large format table.

Column type Active phase I Reference Comment
CapillaryHP-11571.51Lee, Kim, et al., 199930. m/0.25 mm/0.25 μm, 110. C @ 2. min, 2. K/min, 240. C @ 20. min
CapillaryHP-51586.92Lee, Kim, et al., 199930. m/0.53 mm/1. μm, 110. C @ 2. min, 2. K/min, 240. C @ 20. min
CapillaryDB-51595.61Lee and Gray, 199530. m/0.25 mm/0.25 μm, 1. K/min; Tstart: 80. C; Tend: 300. C

References

Lee, Kim, et al., 1999
Lee, C.K.; Kim, E.J.; Jun, J.H., Determination of relative reactivities of free hydroxyl groups in β-cyclodextrin, amylose, and cellulose by reduction-cleavage method, Bull. Korean Chem. Soc., 1999, 20, 10, 1153-1158. [all data]

Lee and Gray, 1995
Lee, C.K.; Gray, G.R., Analysis of positions of substitution of O-acetyl groups in partially O-acetylated cellulose by the reductive-cleavage method, Carbohyd. Res., 1995, 269, 1, 167-174, https://doi.org/10.1016/0008-6215(94)00354-I . [all data]