Dihydroammodendrine

Normal alkane RI, non-polar column, temperature ramp

Data compiled by: NIST Mass Spectrometry Data Center, William E. Wallace, director

Column type Capillary
Active phase DB-1
Column length (m) 30.
Carrier gas He
Substrate
Column diameter (mm) 0.32
Phase thickness (μm)
Tstart (C) 150.
Tend (C) 300.
Heat rate (K/min) 6.
Initial hold (min)
Final hold (min)
I 1850.
ReferenceGreinwald, Bachmann, et al., 1995
Comment MSDC-RI

References

Greinwald, Bachmann, et al., 1995
Greinwald, R.; Bachmann, P.; Lewis, G.; Witte, L.; Czygan, F.-C., Alkaloids of the genus Poecilanthe (Leguminosae: Papilionoideae), Biochem. Syst. Ecol., 1995, 23, 5, 547-553, https://doi.org/10.1016/0305-1978(95)00050-5 . [all data]