m-Aminobenzoic acid, N-isoBOC TBDMS

Normal alkane RI, non-polar column, temperature ramp

Data compiled by: NIST Mass Spectrometry Data Center, William E. Wallace, director

Column type Capillary
Active phase DB-5
Column length (m) 30.
Carrier gas
Substrate
Column diameter (mm) 0.25
Phase thickness (μm) 0.25
Tstart (C) 150.
Tend (C) 280.
Heat rate (K/min) 3.
Initial hold (min) 2.
Final hold (min)
I 2370.
ReferenceOh, Kim, et al., 1994
Comment MSDC-RI

References

Oh, Kim, et al., 1994
Oh, C.-H.; Kim, J.-H.; Kim, K.-R.; Brownson, D.M.; Mabry, T.J., Simultaneous gas chromatographic analysis of non-protein and protein amino acids as N(O,S)-isobutyloxycarbonyl tert.-butyldimethylsilyl derivatives, J. Chromatogr. A, 1994, 669, 1-2, 125-137, https://doi.org/10.1016/0021-9673(94)80344-7 . [all data]