Ketoprofen, TBDMS

Normal alkane RI, non-polar column, temperature ramp

View large format table.

Column type Active phase I Reference Comment
CapillaryDB-52479.8Kim, Shim, et al., 199330. m/0.25 mm/0.25 μm, 230. C @ 2. min, 4. K/min; Tend: 280. C

References

Kim, Shim, et al., 1993
Kim, K.-R.; Shim, W.-H.; Shin, Y.-J.; Park, J.; Myung, S.; Hong, J., Capillary gas chromatography of acidic non-steroidal antiinflammatory drugs as tert.-butyldimethylsilyl derivatives, J. Chromatogr. A, 1993, 641, 2, 319-327, https://doi.org/10.1016/0021-9673(93)80148-2 . [all data]