Benzaldehyde, 2-hydroxy, 3-chloro, 5-(1,1,3,3-tetramethylbutyl)

Van Den Dool and Kratz RI, non-polar column, temperature ramp

View large format table.

Column type Active phase I Reference Comment
PackedSE-301960.Staniewski, 1991GasChrom Q, 4. K/min; Column length: 2. m; Tstart: 80. C; Tend: 250. C

References

Staniewski, 1991
Staniewski, J., Gas chromatographic analysis of some hydroxyoxime extractants of metals, Chem. Anal. (Warsaw), 1991, 36, 2, 325-333. [all data]