7-tiglyl echinatine, diTMS, dihydro

Normal alkane RI, non-polar column, temperature ramp

View large format table.

Column type Active phase I Reference Comment
CapillaryCP Sil 5 CB2673.Hendriks, Huizing, et al., 19886. K/min; Column length: 25. m; Column diameter: 0.32 mm; Tstart: 150. C; Tend: 325. C

References

Hendriks, Huizing, et al., 1988
Hendriks, H.; Huizing, H.J.; Bruins, A.P., Ammonium positive-ion and hydroxide negative-ion chemical ionization gas chromatography-mass spectrometry for the identifcation of pyrrolizidine alkaloids in Eupatorium rotundifolium L. var. ovatum, J. Chromatogr., 1988, 428, 352-356, https://doi.org/10.1016/S0378-4347(00)83927-4 . [all data]