2-(2-Pyridyl)propane-1,3-diol, ferroceneboronate derivative

Kovats' RI, non-polar column, isothermal

View large format table.

Column type Active phase Temperature (C) I Reference Comment
CapillaryOV-1225.2610.Brooks and Cole, 1986

References

Brooks and Cole, 1986
Brooks, C.J.W.; Cole, W.J., Analytical separation and characterisation of 1,2- and 1,3-diols as their cyclic ferroceneboronate derivatives, J. Chromatogr., 1986, 362, 113-116, https://doi.org/10.1016/S0021-9673(01)86956-9 . [all data]