trans-2,cis-6-decadiene

Kovats' RI, non-polar column, isothermal

View large format table.

Column type Active phase Temperature (C) I Reference Comment
CapillarySqualane70.978.5Soják, Král'ovicová, et al., 1984195. m/0.25 mm/0.08 μm, H2

References

Soják, Král'ovicová, et al., 1984
Soják, L.; Král'ovicová, E.; Ostrovský, I.; Leclercq, P.A., Retention behaviour of conjegated and isolated n-alkadienes. Identification of n-nona- and n-decadiens by capillary gas chromatography using structure-retention correlations and mass spectrometry, J. Chromatogr., 1984, 292, 1, 241-261, https://doi.org/10.1016/S0021-9673(01)96207-7 . [all data]