cis-2,trans-4-decadiene

Kovats' RI, non-polar column, isothermal

Data compiled by: NIST Mass Spectrometry Data Center, William E. Wallace, director

Column type Capillary
Active phase Squalane
Column length (m) 195.
Carrier gas H2
Substrate
Column diameter (mm) 0.25
Phase thickness (μm) 0.08
Temperature (C) 70.
I 1041.7
ReferenceSoják, Král'ovicová, et al., 1984
Comment MSDC-RI

References

Soják, Král'ovicová, et al., 1984
Soják, L.; Král'ovicová, E.; Ostrovský, I.; Leclercq, P.A., Retention behaviour of conjegated and isolated n-alkadienes. Identification of n-nona- and n-decadiens by capillary gas chromatography using structure-retention correlations and mass spectrometry, J. Chromatogr., 1984, 292, 1, 241-261, https://doi.org/10.1016/S0021-9673(01)96207-7 . [all data]