3-Methyl-hept-2-enedioic acid dimethyl ester, Z

Normal alkane RI, non-polar column, temperature ramp

View large format table.

Column type Active phase I Reference Comment
CapillaryOV-1011373.Bauer, Neupert, et al., 198480. C @ 5. min, 2. K/min; Column length: 25. m; Tend: 280. C

References

Bauer, Neupert, et al., 1984
Bauer, S.; Neupert, M.; Spiteller, G., Characterization of artefacts produced by treatment of organic acids with diazomethane, J. Chromatogr., 1984, 309, 243-259, https://doi.org/10.1016/0378-4347(84)80032-8 . [all data]