5β-pregnane-3α,11β,17α,20β,21-Pentol, 5β-pregnane

Normal alkane RI, non-polar column, temperature ramp

Data compiled by: NIST Mass Spectrometry Data Center, William E. Wallace, director

Column type Capillary
Active phase OV-101
Column length (m) 25.
Carrier gas
Substrate
Column diameter (mm) 0.32
Phase thickness (μm) 0.3
Tstart (C) 180.
Tend (C) 280.
Heat rate (K/min) 2.
Initial hold (min)
Final hold (min)
I 3088.
ReferenceVrbanac, Sweeley, et al., 1983
Comment MSDC-RI

References

Vrbanac, Sweeley, et al., 1983
Vrbanac, J.J.; Sweeley, C.C.; Pinkston, J.D., Automated metabolic profiling analysis of urinary steroids by a gas chromatography mass spectrometry data system, Biomed. Mass Spectrom., 1983, 10, 3, 155-161, https://doi.org/10.1002/bms.1200100309 . [all data]