Tryptophan-leucine, N(α,ε)-trifluoroacetyl-N-O-permethyl derivative

Normal alkane RI, non-polar column, temperature ramp

View large format table.

Column type Active phase I Reference Comment
CapillaryCP Sil 5 CB2560.Rose, Bairoch, et al., 19835. m/0.34 mm/0.4 μm, He, 80. C @ 1. min, 4. K/min; Tend: 320. C
CapillarySE-542630.Rose, Bairoch, et al., 19835. m/0.34 mm/0.4 μm, He, 80. C @ 1. min, 4. K/min; Tend: 320. C

References

Rose, Bairoch, et al., 1983
Rose, K.; Bairoch, A.; Offord, R.E., Amino acid sequence determination by gas chromatography-mass spectrometry of permethylated peptides. The application of capillary columns, J. Chromatogr., 1983, 268, 197-206, https://doi.org/10.1016/S0021-9673(01)95406-8 . [all data]