Cyclopentane, nonadecyl

Kovats' RI, non-polar column, isothermal

View large format table.

Column type Active phase Temperature (C) I Reference Comment
CapillaryDexsil 300210.2486.Szafranek, Kusmierz, et al., 1982He; Column length: 30. m; Column diameter: 0.30 mm
CapillaryDexsil 300220.2489.Szafranek, Kusmierz, et al., 1982He; Column length: 30. m; Column diameter: 0.30 mm

Kovats' RI, non-polar column, custom temperature program

View large format table.

Column type Active phase I Reference Comment
CapillaryHP-5MS2478.Kenig, Simons, et al., 200530. m/0.25 mm/0.25 μm, He; Program: 60C(1.5min) => 20C/min => 130C => 4C/min => 315C (90min)

References

Szafranek, Kusmierz, et al., 1982
Szafranek, J.; Kusmierz, J.; Czerwiec, W., Gas chromatographic-mass spectrometric investigations of high-boiling crude oil alkane fractions, J. Chromatogr., 1982, 245, 2, 219-228, https://doi.org/10.1016/S0021-9673(00)88591-X . [all data]

Kenig, Simons, et al., 2005
Kenig, F.; Simons, D.-J.H.; Crich, D.; Cowen, J.P.; Ventura, G.T.; Rehbein-Khalily, T., Structure and distribution of branched aliphatic alkanes with quaternary carbon atoms in Cenomanian and Turonian black shales of Pasquia Hills (Saskatchewan, Canada), Org. Geochem., 2005, 36, 1, 117-138, https://doi.org/10.1016/j.orggeochem.2004.06.014 . [all data]