N6-TMS-2'-Deoxyadenosine, 3'-O-acetyl, 5'-O-TBDMS

Kovats' RI, non-polar column, isothermal

View large format table.

Column type Active phase Temperature (C) I Reference Comment
PackedOV-1230.3058.Quilliam, Ogilvie, et al., 1980N2, Gas-Chrom Q

References

Quilliam, Ogilvie, et al., 1980
Quilliam, M.A.; Ogilvie, K.K.; Sadana, K.L.; Westmore, J.B., Gas chromatographic retention data for silyl and acyl derivatives of nucleosides, J. Chromatogr., 1980, 196, 3, 367-378, https://doi.org/10.1016/S0021-9673(00)84739-1 . [all data]