Vinylacetylglycine, methyl ester

Van Den Dool and Kratz RI, non-polar column, temperature ramp

View large format table.

Column type Active phase I Reference Comment
PackedOV-11444.Ramsdell and Tanaka, 1977N2, Anakrom, 4. K/min; Column length: 2. m; Tstart: 80. C

References

Ramsdell and Tanaka, 1977
Ramsdell, H.S.; Tanaka, K., Gas chromatographic studies of twenty metabolically important acylglycines, Clin. Chim. Acta, 1977, 74, 2, 109-114, https://doi.org/10.1016/0009-8981(77)90211-X . [all data]