Linalool Z-furanic oxide

Van Den Dool and Kratz RI, non-polar column, temperature ramp

Data compiled by: NIST Mass Spectrometry Data Center, William E. Wallace, director

Column type Capillary
Active phase Equity-5
Column length (m) 60.
Carrier gas He
Substrate
Column diameter (mm) 0.25
Phase thickness (μm) 1.
Tstart (C) 40.
Tend (C) 260.
Heat rate (K/min) 5.
Initial hold (min) 1.
Final hold (min) 15.
I 1095.
ReferenceRocha, Coelho, et al., 2007
Comment MSDC-RI

References

Rocha, Coelho, et al., 2007
Rocha, S.M.; Coelho, E.; Zrostlikova, J.; Delgadillo, I.; Coimbra b, M.A., Comprehensive two-dimensional gas chromatography with time-of-flight mass spectrometry of monoterpenoids as a powerful tool for grape origin traceability, J. Chromatogr. A, 2007, 1161, 1-2, 292-299, https://doi.org/10.1016/j.chroma.2007.05.093 . [all data]