Ftorafur, TMS

Kovats' RI, non-polar column, isothermal

Data compiled by: NIST Mass Spectrometry Data Center, William E. Wallace, director

Column type Packed
Active phase OV-101
Column length (m) 2.
Carrier gas Ar
Substrate AW-DMCS Chromosorb W HP
Column diameter (mm)
Phase thickness (μm)
Temperature (C) 160.
I 1318.7
ReferenceMiller, Pacáková, et al., 1976
Comment MSDC-RI

References

Miller, Pacáková, et al., 1976
Miller, V.; Pacáková, V.; Smolková, E., Gas-liquid chromatographic analysis of trimethylsilyl derivatives of pyrimidine and purine bases and nucleosides, J. Chromatogr., 1976, 119, 355-367, https://doi.org/10.1016/S0021-9673(00)86799-0 . [all data]