3-hydroxy-(E)-4-hepten-2-one

Van Den Dool and Kratz RI, polar column, temperature ramp

View large format table.

Column type Active phase I Reference Comment
CapillaryDB-Wax1586.Kurniadi, Rhlid, et al., 200330. m/0.25 mm/0.25 μm, He, 40. C @ 5. min, 5. K/min, 220. C @ 5. min

References

Kurniadi, Rhlid, et al., 2003
Kurniadi, T.; Rhlid, R.B.; Fay, L.-B.; Juillerat, M.-A.; Berger, R.G., Chemoenzymatic synthesis of aroma active 5,6-dihydro- and tetrahydropyrazines from aliphatic acyloins produced by Baker's yeast, J. Agric. Food Chem., 2003, 51, 10, 3103-3107, https://doi.org/10.1021/jf0261809 . [all data]