3-hydroxy-1-hexen-4-one

Van Den Dool and Kratz RI, polar column, temperature ramp

Data compiled by: NIST Mass Spectrometry Data Center, William E. Wallace, director

Column type Capillary
Active phase DB-Wax
Column length (m) 30.
Carrier gas He
Substrate
Column diameter (mm) 0.25
Phase thickness (μm) 0.25
Tstart (C) 40.
Tend (C) 220.
Heat rate (K/min) 5.
Initial hold (min) 5.
Final hold (min) 5.
I 1453.
ReferenceKurniadi, Rhlid, et al., 2003
Comment MSDC-RI

References

Kurniadi, Rhlid, et al., 2003
Kurniadi, T.; Rhlid, R.B.; Fay, L.-B.; Juillerat, M.-A.; Berger, R.G., Chemoenzymatic synthesis of aroma active 5,6-dihydro- and tetrahydropyrazines from aliphatic acyloins produced by Baker's yeast, J. Agric. Food Chem., 2003, 51, 10, 3103-3107, https://doi.org/10.1021/jf0261809 . [all data]