3'-acetylsupinine

Kovats' RI, non-polar column, custom temperature program

View large format table.

Column type Active phase I Reference Comment
CapillaryDB-12080.El-Shazly, Abdel-Ghani, et al., 2003He; Column length: 15. m; Column diameter: 0.317 mm; Program: 150C(2min) => 15C/min => 250C => 25C/min => 300C(5min)

References

El-Shazly, Abdel-Ghani, et al., 2003
El-Shazly, A.; Abdel-Ghani, A.; Wink, M., Pyrrolizidine alkaloids from Onosma arenaria (Boraginaceae), Biochem. Syst. Ecol., 2003, 31, 5, 477-485, https://doi.org/10.1016/S0305-1978(02)00177-1 . [all data]