Campherenone

Kovats' RI, non-polar column, temperature ramp

Data compiled by: NIST Mass Spectrometry Data Center, William E. Wallace, director

Column type CapillaryCapillary
Active phase DB-5DB-1
Column length (m) 25.25.
Carrier gas HeHe
Substrate
Column diameter (mm) 0.20.2
Phase thickness (μm) 0.15
Tstart (C) 60.60.
Tend (C) 220.220.
Heat rate (K/min) 3.3.
Initial hold (min) 3.
Final hold (min)
I 1642.1647.
ReferenceMevy, Bessiere, et al., 2006Mevy, Bessiere, et al., 2002
Comment MSDC-RI MSDC-RI

References

Mevy, Bessiere, et al., 2006
Mevy, J.-P.; Bessiere, J.-M.; Greff, S.; Zombre, G.; Viano, J., Composition of the volatile oil from the leaves of Ximenia americana L., Biochem. Syst. Ecol., 2006, 34, 7, 549-553, https://doi.org/10.1016/j.bse.2006.01.007 . [all data]

Mevy, Bessiere, et al., 2002
Mevy, J.P.; Bessiere, J.-M.; Dherbomez, M.; Viano, J., Composition and some biological activities of the essential oils from an African pasture grass: Elionurus elegans Kunth., J. Agric. Food Chem., 2002, 50, 15, 4240-4243, https://doi.org/10.1021/jf0115140 . [all data]