p-Menth-2-en-8-ol

Van Den Dool and Kratz RI, polar column, temperature ramp

View large format table.

Column type Active phase I Reference Comment
CapillaryDB-Wax1561.Choi, Kim. M.-S.L., et al., 200260. m/0.25 mm/0.25 μm, N2, 2. K/min, 230. C @ 20. min; Tstart: 70. C
CapillaryCP-Wax 52CB1618.Chevance and Farmer, 199940. C @ 5. min, 4. K/min, 220. C @ 30. min; Column length: 50. m; Column diameter: 0.32 mm

Normal alkane RI, non-polar column, temperature ramp

View large format table.

Column type Active phase I Reference Comment
CapillaryHP-51208.Figuérédo, Cabassu, et al., 200630. m/0.25 mm/0.25 μm, He, 50. C @ 5. min, 5. K/min, 300. C @ 5. min
CapillaryHP-51208.Figuérédo, Cabassu, et al., 200530. m/0.25 mm/0.25 μm, He, 50. C @ 5. min, 5. K/min, 300. C @ 5. min

References

Choi, Kim. M.-S.L., et al., 2002
Choi, H.-S.; Kim. M.-S.L.; Sawamura, M., Constituents of the essential oil of cnidium officinale Makino, a Korean medicinal plant, Flavour Fragr. J., 2002, 17, 1, 49-53, https://doi.org/10.1002/ffj.1038 . [all data]

Chevance and Farmer, 1999
Chevance, F.F.V.; Farmer, L.J., Release of volatile odor compounds from full-fat and reduced-fat frankfurters, J. Agric. Food Chem., 1999, 47, 12, 5161-5168, https://doi.org/10.1021/jf9905166 . [all data]

Figuérédo, Cabassu, et al., 2006
Figuérédo, G.; Cabassu, P.; Chalchat, J.-C.; Pasquier, B., Studies of Mediterranean oregano populations. VIII. Chemical composition of essential oils of oreganos of various origins, Flavour Fragr. J., 2006, 21, 1, 134-139, https://doi.org/10.1002/ffj.1543 . [all data]

Figuérédo, Cabassu, et al., 2005
Figuérédo, G.; Cabassu, P.; Chalchat, J.-C.; Pasquier, B., Studies of Mediterranean oregano populations- V. Chemical composition of essential oils of oregano: Origanum syriacum L. var. bevanii (Holmes) Ietswaart, O. syriacum L. var. sinaicum (Boiss.) Ietswaart, and O. syriacum L. var. syriacum from Lebanon and Israel, Flavour Fragr. J., 2005, 20, 164-168. [all data]