Phenol, 6-methyl-2-methoxy-3-(1-methylethyl)

Normal alkane RI, polar column, temperature ramp

View large format table.

Column type Active phase I Reference Comment
CapillaryCarbowax 20M2410.Vernin, Lageot, et al., 200150. m/0.22 mm/0.25 μm, He, 2. K/min; Tstart: 60. C; Tend: 220. C

References

Vernin, Lageot, et al., 2001
Vernin, G.; Lageot, C.; Gaydou, E.M.; Parkanyi, C., Analysis of the essential oil of Lippia graveolens HBK from El Salvador, Flavour Fragr. J., 2001, 16, 3, 219-226, https://doi.org/10.1002/ffj.984 . [all data]