3-methyl-3-butenyl hexanoate

Van Den Dool and Kratz RI, non-polar column, temperature ramp

View large format table.

Column type Active phase I Reference Comment
CapillaryCP Sil 5 CB1213.Pino and Marbot, 200150. m/0.32 mm/0.4 μm, He, 60. C @ 10. min, 3. K/min, 280. C @ 60. min

Van Den Dool and Kratz RI, polar column, temperature ramp

View large format table.

Column type Active phase I Reference Comment
CapillaryAT-Wax1522.Pino and Marbot, 200160. m/0.32 mm/0.25 μm, He, 65. C @ 10. min, 2. K/min, 250. C @ 60. min

Normal alkane RI, non-polar column, temperature ramp

View large format table.

Column type Active phase I Reference Comment
CapillaryMethyl Silicone1240.Vendramini and Trugo, 200050. m/0.25 mm/0.5 μm, H2, 40. C @ 0.5 min, 4. K/min; Tend: 260. C

References

Pino and Marbot, 2001
Pino, J.A.; Marbot, R., Volatile flavor constituents of acerola (Malpighia emarginata DC.) fruit, J. Agric. Food Chem., 2001, 49, 12, 5880-5882, https://doi.org/10.1021/jf010270g . [all data]

Vendramini and Trugo, 2000
Vendramini, A.L.; Trugo, L.C., Chemical composition of acerola fruit (Malpighia punicifolia L.) at three stages of maturity, Food Chem., 2000, 71, 2, 195-198, https://doi.org/10.1016/S0308-8146(00)00152-7 . [all data]