ethyl cis-1-propenyl disulfide

Van Den Dool and Kratz RI, non-polar column, temperature ramp

View large format table.

Column type Active phase I Reference Comment
CapillaryDB-11008.Pino, Fuentes, et al., 2001He, 60. C @ 4. min, 4. K/min; Column length: 30. m; Column diameter: 0.32 mm; Tend: 250. C

References

Pino, Fuentes, et al., 2001
Pino, J.A.; Fuentes, V.; Correa, M.T., Volatile constituents of Chinese chive (Allium tuberosum Rottl. ex Sprengel) and Rakkyo (Allium chinense G. Don), J. Agric. Food Chem., 2001, 49, 3, 1328-1330, https://doi.org/10.1021/jf9907034 . [all data]