1-chloromethyladamantane

Kovats' RI, non-polar column, isothermal

View large format table.

Column type Active phase Temperature (C) I Reference Comment
PackedSE-30150.1409.L'vova, Kurbatova, et al., 2001N2, N-AW Chromaton; Column length: 1. m
PackedSE-30150.1409.Yashkin, Kurbatova, et al., 2001CHromaton N-AW; Column length: 1. m
CapillarySE-30145.1404.Burkhard, Vais, et al., 1969N2; Column length: 50. m; Column diameter: 0.27 mm
CapillarySE-30160.1423.Burkhard, Vais, et al., 1969N2; Column length: 50. m; Column diameter: 0.27 mm
CapillarySE-30175.1440.Burkhard, Vais, et al., 1969N2; Column length: 50. m; Column diameter: 0.27 mm
CapillarySE-30190.1455.Burkhard, Vais, et al., 1969N2; Column length: 50. m; Column diameter: 0.27 mm

Kovats' RI, polar column, isothermal

View large format table.

Column type Active phase Temperature (C) I Reference Comment
PackedCarbowax 20M150.1800.L'vova, Kurbatova, et al., 2001N2, N-AW Chromaton; Column length: 1. m
PackedCarbowax 20M150.1800.Yashkin, Kurbatova, et al., 2001Column length: 1. m
CapillaryCarbowax 20M145.1791.Burkhard, Vais, et al., 1969N2; Column length: 50. m; Column diameter: 0.27 mm
CapillaryCarbowax 20M160.1818.Burkhard, Vais, et al., 1969N2; Column length: 50. m; Column diameter: 0.27 mm
CapillaryCarbowax 20M175.1844.Burkhard, Vais, et al., 1969N2; Column length: 50. m; Column diameter: 0.27 mm

References

L'vova, Kurbatova, et al., 2001
L'vova, N.Yu.; Kurbatova, S.V.; Yashkin, S.N.; Kolosova, E.A., Gas chromatography of halogenated adamantanes, Russ. J. Phys. Chem. (Engl. Transl.), 2001, 75, 12, 2053-2056. [all data]

Yashkin, Kurbatova, et al., 2001
Yashkin, S.N.; Kurbatova, S.V.; Buryak, A.K., Gas chromatography of halogenated adamantanes, Russ. Chem. Bull. (Engl. Transl.), 2001, 50, 5, 828-832, https://doi.org/10.1023/A:1011350908009 . [all data]

Burkhard, Vais, et al., 1969
Burkhard, J.; Vais, J.; Vodicka, L.; Landa, S., Adamantane and its derivatives. XVI. The gas chromatographic characterization of adamantane derivatives, J. Chromatogr., 1969, 42, 207-218, https://doi.org/10.1016/S0021-9673(01)80617-8 . [all data]