S-methylthiodecanoate

Normal alkane RI, non-polar column, custom temperature program

View large format table.

Column type Active phase I Reference Comment
CapillaryCP Sil 5 CB1486.Lermusieau, Bulens, et al., 200150. m/0.32 mm/1.2 μm; Program: 36C => 20C/min => 120C(20min) => 2C/min => 250C(30min)

References

Lermusieau, Bulens, et al., 2001
Lermusieau, G.; Bulens, M.; Collin, S., Use of GC-olfactometry to identify the hop aromatic compounds in beer, J. Agric. Food Chem., 2001, 49, 8, 3867-3874, https://doi.org/10.1021/jf0101509 . [all data]