Diphenylmethane, 2,4-dinitro

Kovats' RI, non-polar column, isothermal

View large format table.

Column type Active phase Temperature (C) I Reference Comment
CapillaryOV-1200.2118.3Giumanini, Verardo, et al., 2001

Van Den Dool and Kratz RI, non-polar column, temperature ramp

View large format table.

Column type Active phase I Reference Comment
CapillaryOV-12209.Giumanini, Verardo, et al., 20015. K/min; Tstart: 60. C; Tend: 280. C

References

Giumanini, Verardo, et al., 2001
Giumanini, A.G.; Verardo, G.; Soják, L.; Kubinec, R.; Perjéssy, A., Identification of mononitro and dinitro isomers of diphenylmethane by GC-FT-IR and GC-MS techniques, Ind. Eng. Chem. Res., 2001, 40, 6, 1449-1453, https://doi.org/10.1021/ie000667u . [all data]