2-Methoxyethoxycyclododecane (Ambrolignan)

Kovats' RI, non-polar column, isothermal

View large format table.

Column type Active phase Temperature (C) I Reference Comment
CapillaryOV-1150.1750.2Rudenko and Rudenko, 2005He; Column diameter: 0.25 mm
CapillaryOV-1170.1762.8Rudenko and Rudenko, 2005He; Column diameter: 0.25 mm
CapillaryOV-1190.1779.2Rudenko and Rudenko, 2005He; Column diameter: 0.25 mm
CapillaryOV-1150.1750.2Rudenko and Rudenko, 2000He; Column diameter: 0.25 mm
CapillaryOV-1170.1762.8Rudenko and Rudenko, 2000He; Column diameter: 0.25 mm
CapillaryOV-1190.1779.2Rudenko and Rudenko, 2000He; Column diameter: 0.25 mm

Kovats' RI, polar column, isothermal

View large format table.

Column type Active phase Temperature (C) I Reference Comment
CapillaryCarbowax 40M150.2102.7Rudenko and Rudenko, 2005He; Column diameter: 0.25 mm
CapillaryCarbowax 40M170.2127.8Rudenko and Rudenko, 2005He; Column diameter: 0.25 mm
CapillaryCarbowax 40M190.2156.8Rudenko and Rudenko, 2005He; Column diameter: 0.25 mm
CapillaryCarbowax 40M150.2102.7Rudenko and Rudenko, 2000He; Column diameter: 0.25 mm
CapillaryCarbowax 40M170.2127.8Rudenko and Rudenko, 2000He; Column diameter: 0.25 mm
CapillaryCarbowax 40M190.2156.8Rudenko and Rudenko, 2000He; Column diameter: 0.25 mm

References

Rudenko and Rudenko, 2005
Rudenko, B.A.; Rudenko, G.I., Gas chromatography with open tubular columns of cyclododecane derivatives, J. Anal. Chem. USSR (Engl. Transl.), 2005, 60, 4, 345-348. [all data]

Rudenko and Rudenko, 2000
Rudenko, B.A.; Rudenko, G.I., Capillary chromatography of cyclododecane derivatives, Proceedings, 23rd ISCC; CD-ROM, 2000, retrieved from http://www.richrom.com/assets/CD23PDF. [all data]