(Z,Z)-2,4-heptadienal

Van Den Dool and Kratz RI, non-polar column, custom temperature program

View large format table.

Column type Active phase I Reference Comment
CapillaryBPX-51001.Byrne, Bredie, et al., 200250. m/0.25 mm/0.25 μm, He; Program: 0C (5min) => 40C/min => 40C (2min) => 4C/min => 280C
CapillaryDB-51013.Parker, Hassell, et al., 200050. m/0.32 mm/0.5 μm, He; Program: oC(5min) => 60C/min => 60C (5min) => 4C/min => 250C

References

Byrne, Bredie, et al., 2002
Byrne, D.V.; Bredie, W.L.P.; Mottram, D.S.; Martens, M., Sensory and chemical investigations on the effect of oven cooking on warmed-over flavour development in chicken meat, Meat Sci., 2002, 61, 2, 127-139, https://doi.org/10.1016/S0309-1740(01)00171-1 . [all data]

Parker, Hassell, et al., 2000
Parker, J.K.; Hassell, G.M.E.; Mottram, D.S.; Guy, R.C.E., Sensory and instrumental analyses of volatiles generated during the extrusion cooking of oat flours, J. Agric. Food Chem., 2000, 48, 8, 3497-3506, https://doi.org/10.1021/jf991302r . [all data]