Nonyl 2-bromobutanoate

Kovats' RI, non-polar column, isothermal

Data compiled by: NIST Mass Spectrometry Data Center, William E. Wallace, director

Column type Capillary
Active phase OV-101
Column length (m) 15.
Carrier gas
Substrate
Column diameter (mm) 0.22
Phase thickness (μm)
Temperature (C) 200.
I 1700.
ReferenceKomárek, Hornová, et al., 1983
Comment MSDC-RI

References

Komárek, Hornová, et al., 1983
Komárek, K.; Hornová, L.; Horna, A.; Churácek, J., Glass capillary gas chromatography of homologous series of esters. III. Separation of alkyl halogenopropionates and halogenobutyrates on OV-101, J. Chromatogr., 1983, 262, 316-320, https://doi.org/10.1016/S0021-9673(01)88112-7 . [all data]