1,2-Epoxyhumulene

Normal alkane RI, non-polar column, temperature ramp

View large format table.

Column type Active phase I Reference Comment
CapillaryDB-11608.Bailac, Dellacasa, et al., 199960. m/0.25 mm/0.25 μm, N2, 75. C @ 1. min, 4. K/min, 220. C @ 8. min

Normal alkane RI, polar column, custom temperature program

View large format table.

Column type Active phase I Reference Comment
CapillaryInnowax2071.Tunaher, Kirimer, et al., 200360. m/0.25 mm/0.25 μm, He; Program: 60C(10min) => 4C/min => 220C(10min) => 1C/min => 240C (20min)
CapillaryInnowax FSC2071.Baser, Demirei, et al., 200260. m/0.25 mm/0.25 μm, He; Program: 60C(10min) => 4C/min => 220C(10min) => 1C/min => 240C

References

Bailac, Dellacasa, et al., 1999
Bailac, P.N.; Dellacasa, A.D.; Duschatzky, C.B.; Firpo, N.; Ponzi, M.I., Composicion del aceite esencial y actividad antimicrobiana de Aloysia gratissima de San Luis - Argentina, An. Asoc. Quim. Argent., 1999, 87, 3/4, 149-153. [all data]

Tunaher, Kirimer, et al., 2003
Tunaher, Z.; Kirimer, N.; Baser, K.H.C., Wood essential oils of Juniperus foetidissima Willd., Holzforschung, 2003, 57, 140-144. [all data]

Baser, Demirei, et al., 2002
Baser, K.H.C.; Demirei, B.; Özek, T.; Akalin, E.; Özhatay, N., Micro-distilled volatile compounds from Ferulago species growing in Western Turkey, Pharm. Biol., 2002, 40, 6, 466-471, https://doi.org/10.1076/phbi.40.6.466.8439 . [all data]