7-epi-trans-Sesquisabinene hydrate

Van Den Dool and Kratz RI, polar column, temperature ramp

Data compiled by: NIST Mass Spectrometry Data Center, William E. Wallace, director

Column type CapillaryCapillary
Active phase BP-20RTX-Wax
Column length (m) 50.60.
Carrier gas HeHe
Substrate
Column diameter (mm) 0.220.22
Phase thickness (μm) 0.250.25
Tstart (C) 60.60.
Tend (C) 220.230.
Heat rate (K/min) 2.2.
Initial hold (min)
Final hold (min) 20.45.
I 1993.1991.
ReferenceBoti, Koukoua, et al., 2007Cavalli, Tomi, et al., 2003
Comment MSDC-RI MSDC-RI

References

Boti, Koukoua, et al., 2007
Boti, J.B.; Koukoua, G.; N'Guessan, T.Y.; Casanova, J., Chemical variability of Conyza sumatrensis and Microglossa pyrifolia from Côte d'Ivoire, Flavour Fragr. J., 2007, 22, 1, 27-31, https://doi.org/10.1002/ffj.1743 . [all data]

Cavalli, Tomi, et al., 2003
Cavalli, J.-F.; Tomi, F.; Bernardini, A.-F.; Casanova, J., Composition and chemical variability of the bark oil of Cedrelopsis grevei H. Baillon from Madagascar, Flavour Fragr. J., 2003, 18, 6, 532-538, https://doi.org/10.1002/ffj.1263 . [all data]