7-acetyl-9-sarracinoylretronecine

Kovats' RI, non-polar column, temperature ramp

View large format table.

Column type Active phase I Reference Comment
CapillaryOV-12125.El-Shazly, El-Domiaty, et al., 1998He, 6. K/min; Column length: 30. m; Tstart: 150. C; Tend: 300. C

References

El-Shazly, El-Domiaty, et al., 1998
El-Shazly, A.; El-Domiaty, M.; Witte, L.; Wink, M., Pyrrolizidine alkaloids in members of the boraginaceae from Sinai (Egypt), Biochem. Syst. Ecol., 1998, 26, 6, 619-636, https://doi.org/10.1016/S0305-1978(98)00028-3 . [all data]