Kolavelool (2 epimers)

Normal alkane RI, non-polar column, custom temperature program

View large format table.

Column type Active phase I Reference Comment
CapillaryCP Sil 5 CB2050.Weyerstahl, Marschall, et al., 1997N2; Column length: 25. m; Program: not specified

References

Weyerstahl, Marschall, et al., 1997
Weyerstahl, P.; Marschall, H.; Seelmann, I.; Kaul, V.K., Constituents of the flower essential oil of Ageratina adenophora (Spreng.) K. et R. from India, Flavour Fragr. J., 1997, 12, 6, 387-396, https://doi.org/10.1002/(SICI)1099-1026(199711/12)12:6<387::AID-FFJ677>3.0.CO;2-F . [all data]