3-Acetoxyamorpha-4,7(11)-dien-8-one

Normal alkane RI, non-polar column, custom temperature program

Data compiled by: NIST Mass Spectrometry Data Center, William E. Wallace, director

Column type Capillary
Active phase CP Sil 5 CB
Column length (m) 25.
Carrier gas N2
Substrate
Column diameter (mm)
Phase thickness (μm)
Program not specified
I 1965.
ReferenceWeyerstahl, Marschall, et al., 1997
Comment MSDC-RI

References

Weyerstahl, Marschall, et al., 1997
Weyerstahl, P.; Marschall, H.; Seelmann, I.; Kaul, V.K., Constituents of the flower essential oil of Ageratina adenophora (Spreng.) K. et R. from India, Flavour Fragr. J., 1997, 12, 6, 387-396, https://doi.org/10.1002/(SICI)1099-1026(199711/12)12:6<387::AID-FFJ677>3.0.CO;2-F . [all data]