7-methyl-4,5,6,9-tetrathia-1,11-dodecadiene

Normal alkane RI, non-polar column, temperature ramp

View large format table.

Column type Active phase I Reference Comment
CapillaryHP-51819.Kubec, Velísek, et al., 199730. m/0.25 mm/0.25 μm, N2, 40. C @ 3. min, 4. K/min, 240. C @ 10. min

References

Kubec, Velísek, et al., 1997
Kubec, R.; Velísek, J.; Dolezal, M.; Kubelka, V., Sulfur-containing volatiles arising by thermal degradation of alliin and deoxyalliin, J. Agric. Food Chem., 1997, 45, 9, 3580-3585, https://doi.org/10.1021/jf970071q . [all data]