3-ethyl-5-methyl-1,2,4-trithiane

Normal alkane RI, polar column, temperature ramp

Data compiled by: NIST Mass Spectrometry Data Center, William E. Wallace, director

Column type Capillary
Active phase HP-Innowax
Column length (m) 30.
Carrier gas N2
Substrate
Column diameter (mm) 0.25
Phase thickness (μm) 0.5
Tstart (C) 40.
Tend (C) 190.
Heat rate (K/min) 4.
Initial hold (min) 3.
Final hold (min)
I 1848.
ReferenceKubec, Velísek, et al., 1997
Comment MSDC-RI

References

Kubec, Velísek, et al., 1997
Kubec, R.; Velísek, J.; Dolezal, M.; Kubelka, V., Sulfur-containing volatiles arising by thermal degradation of alliin and deoxyalliin, J. Agric. Food Chem., 1997, 45, 9, 3580-3585, https://doi.org/10.1021/jf970071q . [all data]