2-Pentanone, dimethylhydrazone

Kovats' RI, non-polar column, isothermal

View large format table.

Column type Active phase Temperature (C) I Reference Comment
CapillaryMethyl Silicone60.866.Görgényi, Király, et al., 199750. m/0.32 mm/0.52 μm, N2
CapillaryHP-160.866.Király, Körtvélyesi, et al., 199650. m/0.32 mm/0.52 μm, N2
CapillaryHP-560.881.2Király, Körtvélyesi, et al., 199650. m/0.32 mm/0.52 μm, N2

References

Görgényi, Király, et al., 1997
Görgényi, M.; Király, Z.; Körtvélyesi, T.; van Langenhove, H.; Seres, L., Szerkezet és retenció kapcsolata a hidrazonok gázkromatográfiájában, Magy. Kem. Foly., 1997, 103, 12, 576-581. [all data]

Király, Körtvélyesi, et al., 1996
Király, Z.; Körtvélyesi, T.; Seres, L.; Görgényi, M., Structure-retention relationships in the gas chromatography of N,N-dialkylhydrazones, Chromatographia, 1996, 42, 11/12, 653-659, https://doi.org/10.1007/BF02267697 . [all data]