Piperidine, 1-heptyl-2-methyl

Kovats' RI, non-polar column, isothermal

Data compiled by: NIST Mass Spectrometry Data Center, William E. Wallace, director

Column type Capillary
Active phase OV-101
Column length (m) 50.
Carrier gas He
Substrate
Column diameter (mm) 0.30
Phase thickness (μm) 0.40
Temperature (C) 110.
I 1386.
ReferenceZhuravleva, Golovnya, et al., 1993
Comment MSDC-RI

References

Zhuravleva, Golovnya, et al., 1993
Zhuravleva, I.L.; Golovnya, R.V.; Kuzmenko, T.E., The regularities of the gas-chromatographic behavior of methyl-substituted N-alkylpiperidines, Russ. Chem. Bull. (Engl. Transl.), 1993, 42, 10, 1677-1679, https://doi.org/10.1007/BF00697038 . [all data]