2,3-di-O-acetyl-1,4-anhydro-4-O-methyl-D-fucitol

Van Den Dool and Kratz RI, non-polar column, temperature ramp

Data compiled by: NIST Mass Spectrometry Data Center, William E. Wallace, director

Column type Capillary
Active phase DB-5
Column length (m) 30.
Carrier gas He
Substrate
Column diameter (mm) 0.25
Phase thickness (μm) 0.25
Tstart (C) 80.
Tend (C) 300.
Heat rate (K/min) 2.
Initial hold (min)
Final hold (min)
I 1515.80
ReferenceElvebak, Schmitt, et al., 1993
Comment MSDC-RI

References

Elvebak, Schmitt, et al., 1993
Elvebak, L.E., II; Schmitt, T.; Gray, G.R., Authentic standards for the reductive-cleavage method. The positional isomers of partially methylated and acetylated or benzoylated 1,5-anhydro-D-fucitol, Carbohyd. Res., 1993, 246, 1, 1-11, https://doi.org/10.1016/0008-6215(93)84019-3 . [all data]