sedanenolide

Van Den Dool and Kratz RI, non-polar column, temperature ramp

View large format table.

Column type Active phase I Reference Comment
CapillaryHP-11701.Tang, Zhang, et al., 199050. m/0.32 mm/1.05 μm, He, 2. K/min, 230. C @ 40. min; Tstart: 40. C

References

Tang, Zhang, et al., 1990
Tang, J.; Zhang, Y.; Hartman, T.G.; Rosen, R.T.; Ho, C.-T., Free and glycosidically bound volatile compounds in fresh celery (Apium graveolens L.), J. Agric. Food Chem., 1990, 38, 10, 1937-1940, https://doi.org/10.1021/jf00100a013 . [all data]