3,4-didehydro-β-ionol

Van Den Dool and Kratz RI, polar column, temperature ramp

Data compiled by: NIST Mass Spectrometry Data Center, William E. Wallace, director

Column type CapillaryCapillary
Active phase DB-WaxDB-Wax
Column length (m) 30.30.
Carrier gas HeHe
Substrate
Column diameter (mm) 0.250.25
Phase thickness (μm) 0.250.25
Tstart (C) 50.50.
Tend (C) 220.250.
Heat rate (K/min) 4.4.
Initial hold (min) 4.
Final hold (min) 20.
I 2007.2013.
ReferenceOsorio, Alarcon, et al., 2006Winterhalter, Lander, et al., 1987
Comment MSDC-RI MSDC-RI

Kovats' RI, non-polar column, temperature ramp

Data compiled by: NIST Mass Spectrometry Data Center, William E. Wallace, director

Column type CapillaryCapillary
Active phase DB-1DB-1
Column length (m) 60.60.
Carrier gas HeHe
Substrate
Column diameter (mm) 0.320.32
Phase thickness (μm) 0.250.25
Tstart (C) 30.30.
Tend (C) 210.210.
Heat rate (K/min) 2.2.
Initial hold (min) 4.4.
Final hold (min)
I 1392.1397.
ReferenceTakeoka, Flath, et al., 1990Takeoka, Flath, et al., 1990
Comment MSDC-RI MSDC-RI

References

Osorio, Alarcon, et al., 2006
Osorio, C.; Alarcon, M.; Moreno, C.; Bonilla, A.; Barrios, J.; Garzon, C.; Duque, C., Characterization of Odor-Active Volatiles in Champa ( Campomanesia lineatifolia R. P.), J. Agric. Food Chem., 2006, 54, 2, 509-516, https://doi.org/10.1021/jf052098c . [all data]

Winterhalter, Lander, et al., 1987
Winterhalter, P.; Lander, V.; Schreier, P., Influence of sample preparation on the composition of quince (Cydonia oblonga, Mill.) flavor, J. Agric. Food Chem., 1987, 35, 3, 335-337, https://doi.org/10.1021/jf00075a013 . [all data]